Reaction Details
TargetSodium channel protein type 9 subunit alpha
LigandBDBM371778
Substrate/Competitorn/a
Meas. Tech.Rubidium efflux assay
IC50 8.00±n/a nM
Citation Ramdas, VLoriya, RMBanerjee, MPatil, PRJoshi, AADatrange, LSWalke, DSKhan, THDas, AKGote, GNKalhapure, VMPalle, VPKamboj, RK Sulfonamide compounds as voltage-gated sodium channel modulators US Patent US10239869 Publication Date 3/26/2019
 
Sodium channel protein type 9 subunit alpha
Name:Sodium channel protein type 9 subunit alpha
Type:Protein
Mol. Mass.:226375.97
Organism:Homo sapiens (Human)
Description:Q15858
Residue:1988
BDBM371778
NameBDBM371778
Synonyms:4-(2-(6-methylpyridin-3-yl)-4-(trifluoromethyl)phenyl)-N-(pyrimidin-4-yl)chroman-7-sulfonamide | US10239869, Example 204
TypeSmall organic molecule
Emp. Form.C26H21F3N4O3S
Mol. Mass.526.53
SMILESCc1ccc(cn1)-c1cc(ccc1[C@H]1CCOc2cc(ccc12)S(=O)(=O)Nc1ccncn1)C(F)(F)F