Reaction Details
TargetPurine nucleoside phosphorylase
LigandBDBM22103
Substrate/CompetitorBDBM22104
Meas. Tech.PNP Inhibition Assay
pH7.7±n/a
Temperature295.15±n/a K
Ki 0.229±0.015 nM
Km40000±n/a nM
Citation Evans, GBFurneaux, RHGreatrex, BMurkin, ASSchramm, VLTyler, PC Azetidine based transition state analogue inhibitors of N-ribosyl hydrolases and phosphorylases. J Med Chem51:948-56 (2008) 
 
Purine nucleoside phosphorylase
Name:Purine nucleoside phosphorylase
Type:Enzyme
Mol. Mass.:32119.53
Organism:Homo sapiens (Human)
Description:n/a
Residue:289
BDBM22103
BDBM22104
NameBDBM22103
Synonyms:7-{[3,3-bis(hydroxymethyl)azetidin-1-yl]methyl}-3H,4H,5H-pyrrolo[3,2-d]pyrimidin-4-one | Azetidine based compound, 34
TypeSmall organic molecule
Emp. Form.C12H16N4O3
Mol. Mass.264.2804
SMILESOCC1(CO)CN(Cc2c[nH]c3c2nc[nH]c3=O)C1