Reaction Details
Target5'-methylthioadenosine/S-adenosylhomocysteine nucleosidase
LigandBDBM22112
Substrate/CompetitorBDBM22111
Meas. Tech.MTAP/MTAN Inhibition Assay
pH7±n/a
Temperature295.15±n/a K
Ki 0.45±0.05 nM
Km430±n/a nM
Citation Evans, GBFurneaux, RHGreatrex, BMurkin, ASSchramm, VLTyler, PC Azetidine based transition state analogue inhibitors of N-ribosyl hydrolases and phosphorylases. J Med Chem51:948-56 (2008) 
 
5'-methylthioadenosine/S-adenosylhomocysteine nucleosidase
Name:5'-methylthioadenosine/S-adenosylhomocysteine nucleosidase
Type:Enzyme
Mol. Mass.:24347.14
Organism:Escherichia coli (strain K12)
Description:P0AF12
Residue:232
BDBM22112
BDBM22111
NameBDBM22112
Synonyms:7-({3-[(methylsulfanyl)methyl]azetidin-1-yl}methyl)-5H-pyrrolo[3,2-d]pyrimidin-4-amine | Azetidine based compound, 44
TypeSmall organic molecule
Emp. Form.C12H17N5S
Mol. Mass.263.362
SMILESCSCC1CN(Cc2c[nH]c3c(N)ncnc23)C1