Reaction Details
TargetLegumain
LigandBDBM22128
Substrate/CompetitorBDBM22115
Meas. Tech.AE Enzyme Inhibition Assay
Temperature298.15±n/a K
IC50<1±n/a nM
Commentsextracted
Citation Götz, MGJames, KEHansell, EDvorák, JSeshaadri, ASojka, DKopácek, PMcKerrow, JHCaffrey, CRPowers, JC Aza-peptidyl Michael Acceptors. A New Class of Potent and Selective Inhibitors of Asparaginyl Endopeptidases (Legumains) from Evolutionarily Diverse Pathogens. J Med Chem51:2816-32 (2008) 
 
Legumain
Name:Legumain
Type:Enzyme
Mol. Mass.:49038.15
Organism:Ixodes ricinus
Description:IrAE was expressed and produced in Pichia pastoris.
Residue:441
BDBM22128
BDBM22115
NameBDBM22128
Synonyms:aza-peptide Michael acceptor, 5l | benzyl N-[(1S)-1-{[(2S)-1-[(2E)-N-benzyl-3-[N-(carbamoylmethyl)hydrazido]-N-phenylprop-2-enamide]-1-oxopropan-2-yl]carbamoyl}ethyl]carbamate
TypeSmall organic molecule
Emp. Form.C33H36N6O7
Mol. Mass.628.6749
SMILESC[C@H](NC(=O)OCc1ccccc1)C(=O)N[C@@H](C)C(=O)NN(CC(N)=O)C(=O)C=CC(=O)N(Cc1ccccc1)c1ccccc1