Reaction Details
TargetLegumain
LigandBDBM22145
Substrate/CompetitorBDBM22115
Meas. Tech.AE Enzyme Inhibition Assay
Temperature298.15±n/a K
IC50 2.8±n/a nM
Commentsextracted
Citation Götz, MGJames, KEHansell, EDvorák, JSeshaadri, ASojka, DKopácek, PMcKerrow, JHCaffrey, CRPowers, JC Aza-peptidyl Michael Acceptors. A New Class of Potent and Selective Inhibitors of Asparaginyl Endopeptidases (Legumains) from Evolutionarily Diverse Pathogens. J Med Chem51:2816-32 (2008) 
 
Legumain
Name:Legumain
Type:Enzyme
Mol. Mass.:49038.15
Organism:Ixodes ricinus
Description:IrAE was expressed and produced in Pichia pastoris.
Residue:441
BDBM22145
BDBM22115
NameBDBM22145
Synonyms:Biotinylated Michael acceptor, 12 | ethyl (2E)-4-[(2S)-2-[(2S)-2-{5-[(3aS,4S,6aR)-2-oxo-hexahydro-1H-thieno[3,4-d]imidazolidin-4-yl]pentanamido}propanamido]-N'-(carbamoylmethyl)propanehydrazido]-4-oxobut-2-enoate
TypeSmall organic molecule
Emp. Form.C24H37N7O8S
Mol. Mass.583.658
SMILES[H][C@]12CS[C@@H](CCCCC(=O)N[C@@H](C)C(=O)N[C@@H](C)C(=O)NN(CC(N)=O)C(=O)C=CC(=O)OCC)[C@@]1([H])NC(=O)N2