Reaction Details
TargetSubstance-P receptor
LigandBDBM261479
Substrate/Competitorn/a
Meas. Tech.Receptor Binding Assay
pH7.4±n/a
Temperature298.15±n/a K
IC50 1.78±n/a nM
Commentsextracted
Citation Shimizu, KOhno, KMiyagi, TUeno, YSuzuki, H Cyclohexyl pyridine derivative US Patent US9708266 Publication Date 7/18/2017
 
Substance-P receptor
Name:Substance-P receptor
Type:G Protein-Coupled Receptor (GPCR)
Mol. Mass.:46254.43
Organism:Homo sapiens (Human)
Description:P25103
Residue:407
BDBM261479
NameBDBM261479
Synonyms:US10011568, Ex. No. 2 | US9708266, 2
TypeSmall organic molecule
Emp. Form.C34H35F7N2O3
Mol. Mass.652.6421
SMILESCN(C(=O)C(C)(C)c1cc(cc(c1)C(F)(F)F)C(F)(F)F)c1cnc(cc1-c1ccc(F)cc1C)C1CCC(CCC(O)=O)CC1