Reaction Details
TargetSubstance-P receptor
LigandBDBM261487
Substrate/Competitorn/a
Meas. Tech.Receptor Binding Assay
pH7.4±n/a
Temperature298.15±n/a K
IC50 2.79±n/a nM
Commentsextracted
Citation Shimizu, KOhno, KMiyagi, TUeno, YSuzuki, H Cyclohexyl pyridine derivative US Patent US9708266 Publication Date 7/18/2017
 
Substance-P receptor
Name:Substance-P receptor
Type:G Protein-Coupled Receptor (GPCR)
Mol. Mass.:46254.43
Organism:Homo sapiens (Human)
Description:P25103
Residue:407
BDBM261487
NameBDBM261487
Synonyms:US10011568, Ex. No. 10 | US9708266, 10
TypeSmall organic molecule
Emp. Form.C34H35F7N2O3
Mol. Mass.652.6421
SMILESCC(C1CCC(CC1)c1cc(c(cn1)N(C)C(=O)C(C)(C)c1cc(cc(c1)C(F)(F)F)C(F)(F)F)-c1ccc(F)cc1C)C(O)=O