Reaction Details
TargetD(1A) dopamine receptor
LigandBDBM371821
Substrate/Competitorn/a
Meas. Tech.In Vitro Binding Assay for DDR1
IC50 12.7±n/a nM
Citation Buettelmann, BKocer, BKuhn, BPrunotto, MRichter, HRitter, MRudolph, MSatz, AL Triaza-spirodecanones as DDR1 inhibitors US Patent US10239876 Publication Date 3/26/2019
 
D(1A) dopamine receptor
Name:D(1A) dopamine receptor
Type:Enzyme
Mol. Mass.:49303.43
Organism:Homo sapiens (Human)
Description:P21728
Residue:446
BDBM371821
NameBDBM371821
Synonyms:2-[1-(3-Fluoro-phenyl)-4-oxo-8-(1H-pyrazolo[3,4-b]pyridine-5-carbonyl)-1,3,8-triaza-spiro[4.5]dec-3-yl]-N-(2,2,2-trifluoro-ethyl)-acetamide US10435407, Example 2
TypeSmall organic molecule
Emp. Form.C24H23F4N7O3
Mol. Mass.533.4781
SMILESFc1cccc(c1)N1CN(CC(=O)NCC(F)(F)F)C(=O)C11CCN(CC1)C(=O)c1cnc2[nH]ncc2c1