Reaction Details
TargetD(1A) dopamine receptor
LigandBDBM371909
Substrate/Competitorn/a
Meas. Tech.In Vitro Binding Assay for DDR1
IC50 29.6±n/a nM
Citation Buettelmann, BKocer, BKuhn, BPrunotto, MRichter, HRitter, MRudolph, MSatz, AL Triaza-spirodecanones as DDR1 inhibitors US Patent US10239876 Publication Date 3/26/2019
 
D(1A) dopamine receptor
Name:D(1A) dopamine receptor
Type:Enzyme
Mol. Mass.:49303.43
Organism:Homo sapiens (Human)
Description:P21728
Residue:446
BDBM371909
NameBDBM371909
Synonyms:N-Methyl-2-(4-oxo-1-phenyl-8-(1H-pyrazolo[3,4-b]pyridine-5-carbonyl)-1,3,8-triazaspiro[4.5]decan-3-yl)-N-(2,2,2-trifluoroethyl)acetamide US10435407, Example 27
TypeSmall organic molecule
Emp. Form.C25H26F3N7O3
Mol. Mass.529.5142
SMILESCN(CC(F)(F)F)C(=O)CN1CN(c2ccccc2)C2(CCN(CC2)C(=O)c2cnc3[nH]ncc3c2)C1=O