Reaction Details
TargetD(1A) dopamine receptor
LigandBDBM372120
Substrate/Competitorn/a
Meas. Tech.In Vitro Binding Assay for DDR1
IC50 23.3±n/a nM
Citation Buettelmann, BKocer, BKuhn, BPrunotto, MRichter, HRitter, MRudolph, MSatz, AL Triaza-spirodecanones as DDR1 inhibitors US Patent US10239876 Publication Date 3/26/2019
 
D(1A) dopamine receptor
Name:D(1A) dopamine receptor
Type:Enzyme
Mol. Mass.:49303.43
Organism:Homo sapiens (Human)
Description:P21728
Residue:446
BDBM372120
NameBDBM372120
Synonyms:(R)- or (S)-8-(1H-indazole-5-carbonyl)-3-(2-oxo-2-(2-(trifluoromethyl)morpholino)ethyl)-1-phenyl-1,3,8-triazaspiro[4.5]decan-4-one US10435407, Example 143
TypeSmall organic molecule
Emp. Form.C28H29F3N6O4
Mol. Mass.570.5629
SMILESFC(F)(F)[C@@H]1CN(CCO1)C(=O)CN1CN(c2ccccc2)C2(CCN(CC2)C(=O)c2ccc3[nH]ncc3c2)C1=O