Reaction Details
Target3-hydroxy-3-methylglutaryl-coenzyme A reductase
LigandBDBM22146
Substrate/CompetitorBDBM18373
Meas. Tech.HMG-CoA Reductase Enzyme Assay and Inhibition of Cellular Cholesterol Synthesis Assay
pH7±n/a
Temperature310.15±n/a K
IC50 6.9±0.3 nM
EC50 7.7±n/a nM
Citation Ahmad, SMadsen, CSStein, PDJanovitz, EHuang, CNgu, KBisaha, SKennedy, LJChen, BCZhao, RSitkoff, DMonshizadegan, HYin, XRyan, CSZhang, RGiancarli, MBird, EChang, MChen, XSetters, RSearch, DZhuang, SNguyen-Tran, VCuff, CAHarrity, TDarienzo, CJLi, TReeves, RABlanar, MABarrish, JCZahler, RRobl, JA (3R,5S,E)-7-(4-(4-Fluorophenyl)-6-isopropyl-2-(methyl(1-methyl-1H-1,2,4-triazol-5-yl)amino)pyrimidin-5-yl)-3,5-dihydroxyhept-6-enoic Acid (BMS-644950): A Rationally Designed Orally Efficacious 3-Hydroxy-3-methylglutaryl Coenzyme-A Reductase Inhibitor with Reduced Myotoxicity Potential. J Med Chem51:2722-33 (2008) 
 
3-hydroxy-3-methylglutaryl-coenzyme A reductase
Name:3-hydroxy-3-methylglutaryl-coenzyme A reductase
Type:Enzyme
Mol. Mass.:96689.85
Organism:Rattus norvegicus (rat)
Description:Isolated rat liver microsomes were used as enzyme source.
Residue:887
BDBM22146
BDBM18373
NameBDBM22146
Synonyms:(3R,5S,6E)-7-[4-(4-fluorophenyl)-2-[(5-phenyl-1,2,4-thiadiazol-3-yl)amino]-6-(propan-2-yl)pyrimidin-5-yl]-3,5-dihydroxyhept-6-enoic acid thiadiazole compound, 8a
TypeSmall organic molecule
Emp. Form.C28H28FN5O4S
Mol. Mass.549.616
SMILESCC(C)c1nc(Nc2nsc(n2)-c2ccccc2)nc(-c2ccc(F)cc2)c1\C=C\[C@@H](O)C[C@@H](O)CC(O)=O