Reaction Details
TargetReceptor-interacting serine/threonine-protein kinase 2
LigandBDBM372160
Substrate/Competitorn/a
Meas. Tech.RIPK2 Inhibition Assay
IC50 300±n/a nM
Citation Laufer, RNg, GBrokx, RPauls, HWLi, SMason, JMBray, MR RIPK2 inhibitors and method of treating cancer with same US Patent US10239881 Publication Date 3/26/2019
 
Receptor-interacting serine/threonine-protein kinase 2
Name:Receptor-interacting serine/threonine-protein kinase 2
Type:Protein
Mol. Mass.:61201.30
Organism:Homo sapiens (Human)
Description:n/a
Residue:540
BDBM372160
NameBDBM372160
Synonyms:6-(2-fluorophenyl)- N-(3-morpholino- phenyl)- 5H-pyrrolo[3,2- d]pyrimidin-2- amine US10875863, Example A13
TypeSmall organic molecule
Emp. Form.C22H20FN5O
Mol. Mass.389.4255
SMILESFc1ccccc1-c1cc2nc(Nc3cccc(c3)N3CCOCC3)ncc2[nH]1