Reaction Details
TargetSphingosine 1-phosphate receptor 1
LigandBDBM22212
Substrate/CompetitorBDBM22202
Meas. Tech.S1P Receptor Binding Assay
pH7.5±n/a
Temperature295.15±n/a K
IC50 1.8±n/a nM
Citation Li, ZChen, WHale, JJLynch, CLMills, SGHajdu, RKeohane, CARosenbach, MJMilligan, JAShei, GJChrebet, GParent, SABergstrom, JCard, DForrest, MQuackenbush, EJWickham, LAVargas, HEvans, RMRosen, HMandala, S Discovery of potent 3,5-diphenyl-1,2,4-oxadiazole sphingosine-1-phosphate-1 (S1P1) receptor agonists with exceptional selectivity against S1P2 and S1P3. J Med Chem48:6169-73 (2005) 
 
Sphingosine 1-phosphate receptor 1
Name:Sphingosine 1-phosphate receptor 1
Type:Enzyme
Mol. Mass.:42836.02
Organism:Homo sapiens (Human)
Description:P21453
Residue:382
BDBM22212
BDBM22202
NameBDBM22212
Synonyms:1,2,4-oxadiazole based compound, 29 | 1-[(4-{5-[4-(propan-2-yloxy)phenyl]-1,2,4-oxadiazol-3-yl}phenyl)methyl]azetidine-3-carboxylic acid
TypeSmall organic molecule
Emp. Form.C22H23N3O4
Mol. Mass.393.4357
SMILESCC(C)Oc1ccc(cc1)-c1nc(no1)-c1ccc(CN2CC(C2)C(O)=O)cc1