Reaction Details
TargetSphingosine 1-phosphate receptor 3
LigandBDBM22220
Substrate/CompetitorBDBM22202
Meas. Tech.S1P Receptor Binding Assay
Temperature298.15±n/a K
IC50 4018±n/a nM
Commentsextracted
Citation Li, ZChen, WHale, JJLynch, CLMills, SGHajdu, RKeohane, CARosenbach, MJMilligan, JAShei, GJChrebet, GParent, SABergstrom, JCard, DForrest, MQuackenbush, EJWickham, LAVargas, HEvans, RMRosen, HMandala, S Discovery of potent 3,5-diphenyl-1,2,4-oxadiazole sphingosine-1-phosphate-1 (S1P1) receptor agonists with exceptional selectivity against S1P2 and S1P3. J Med Chem48:6169-73 (2005) 
 
Sphingosine 1-phosphate receptor 3
Name:Sphingosine 1-phosphate receptor 3
Type:G Protein-Coupled Receptor (GPCR)
Mol. Mass.:42278.13
Organism:Homo sapiens (Human)
Description:Q99500
Residue:378
BDBM22220
BDBM22202
NameBDBM22220
Synonyms:1,2,4-oxadiazole based compound, 37 | 1-{[4-(5-{4-[(1R)-3,3-difluorocyclopentyl]phenyl}-1,2,4-oxadiazol-3-yl)phenyl]methyl}azetidine-3-carboxylic acid
TypeSmall organic molecule
Emp. Form.C24H23F2N3O3
Mol. Mass.439.4545
SMILESOC(=O)C1CN(Cc2ccc(cc2)-c2noc(n2)-c2ccc(cc2)[C@@H]2CCC(F)(F)C2)C1