Reaction Details
TargetSphingosine 1-phosphate receptor 4
LigandBDBM22206
Substrate/CompetitorBDBM22202
Meas. Tech.S1P Receptor Binding Assay
Temperature298.15±n/a K
IC50 150±n/a nM
Commentsextracted
Citation Li, ZChen, WHale, JJLynch, CLMills, SGHajdu, RKeohane, CARosenbach, MJMilligan, JAShei, GJChrebet, GParent, SABergstrom, JCard, DForrest, MQuackenbush, EJWickham, LAVargas, HEvans, RMRosen, HMandala, S Discovery of potent 3,5-diphenyl-1,2,4-oxadiazole sphingosine-1-phosphate-1 (S1P1) receptor agonists with exceptional selectivity against S1P2 and S1P3. J Med Chem48:6169-73 (2005) 
 
Sphingosine 1-phosphate receptor 4
Name:Sphingosine 1-phosphate receptor 4
Type:G Protein-Coupled Receptor (GPCR)
Mol. Mass.:41647.39
Organism:Homo sapiens (Human)
Description:n/a
Residue:384
BDBM22206
BDBM22202
NameBDBM22206
Synonyms:1,2,4-oxadiazole based compound, 23 | 1-({4-[5-(4-propylphenyl)-1,2,4-oxadiazol-3-yl]phenyl}methyl)azetidine-3-carboxylic acid
TypeSmall organic molecule
Emp. Form.C22H23N3O3
Mol. Mass.377.4363
SMILESCCCc1ccc(cc1)-c1nc(no1)-c1ccc(CN2CC(C2)C(O)=O)cc1