Reaction Details
TargetTyrosine-protein kinase BTK
LigandBDBM340124
Substrate/Competitorn/a
Meas. Tech.Btk Enzyme Activity
EC50<10.00±n/a nM
Citation Barf, TAJans, CGde Man, APOubrie, AARaaijmakers, HCRewinkel, JBSterrenburg, JGWijkmans, JC 4-imidazopyridazin-1-yl-benzamides as BTK inhibitors US Patent US10239883 Publication Date 3/26/2019
 
Tyrosine-protein kinase BTK
Name:Tyrosine-protein kinase BTK
Type:Enzyme
Mol. Mass.:76289.95
Organism:Homo sapiens (Human)
Description:Q06187
Residue:659
BDBM340124
NameBDBM340124
Synonyms:US10239883, Example 12 US9758524, Example 12
TypeSmall organic molecule
Emp. Form.C28H27N7O2S
Mol. Mass.525.625
SMILESCC#CC(=O)N1CCC[C@H]1c1nc(-c2ccc(cc2)C(=O)Nc2nc3CCCCc3s2)c2c(N)nccn12