Reaction Details
TargetProto-oncogene tyrosine-protein kinase Src
LigandBDBM340150
Substrate/Competitorn/a
Meas. Tech.Src Enzyme Activity
EC50>1000±n/a nM
Citation Barf, TAJans, CGde Man, APOubrie, AARaaijmakers, HCRewinkel, JBSterrenburg, JGWijkmans, JC 4-imidazopyridazin-1-yl-benzamides as BTK inhibitors US Patent US10239883 Publication Date 3/26/2019
 
Proto-oncogene tyrosine-protein kinase Src
Name:Proto-oncogene tyrosine-protein kinase Src
Type:Protein
Mol. Mass.:59838.60
Organism:Homo sapiens (Human)
Description:P12931
Residue:536
BDBM340150
NameBDBM340150
Synonyms:US10239883, Example 39 US9758524, Example 39
TypeSmall organic molecule
Emp. Form.C26H22F3N7O2
Mol. Mass.521.4938
SMILESCC#CC(=O)N(C)[C@@H](C)c1nc(-c2ccc(cc2)C(=O)Nc2cc(ccn2)C(F)(F)F)c2c(N)nccn12