Reaction Details
TargetTyrosine-protein kinase Fyn
LigandBDBM340156
Substrate/Competitorn/a
Meas. Tech.FynT Enzyme Activity
EC50>1000±n/a nM
Citation Barf, TAJans, CGde Man, APOubrie, AARaaijmakers, HCRewinkel, JBSterrenburg, JGWijkmans, JC 4-imidazopyridazin-1-yl-benzamides as BTK inhibitors US Patent US10239883 Publication Date 3/26/2019
 
Tyrosine-protein kinase Fyn
Name:Tyrosine-protein kinase Fyn
Type:Enzyme
Mol. Mass.:60762.21
Organism:Homo sapiens (Human)
Description:P06241
Residue:537
BDBM340156
NameBDBM340156
Synonyms:(S)-4-(8-amino-3-(1-but-2- ynoylpyrrolidin-2-yl)imidazo[1,5- a]pyrazin-1-yl)-N-(4-propylpyridin- 2-yl)benzamide US10934296, Example 47 | US9758524, Example 47
TypeSmall organic molecule
Emp. Form.C29H29N7O2
Mol. Mass.507.5863
SMILESCCCc1ccnc(NC(=O)c2ccc(cc2)-c2nc([C@@H]3CCCN3C(=O)C#CC)n3ccnc(N)c23)c1