Reaction Details
TargetRAF proto-oncogene serine/threonine-protein kinase
LigandBDBM202731
Substrate/Competitorn/a
Meas. Tech.In Vitro Raf Activity
IC50 0.100±n/a nM
Citation Aversa, RJBarsanti, PABurger, MTDillon, MPDipesa, AHu, CLou, YNishiguchi, GAPan, YPolyakov, VRRamurthy, SRico, ACSetti, LQSmith, ASubramanian, STaft, BRTanner, HRWan, LYusuff, N Biaryl amide compounds as kinase inhibitors US Patent US10245267 Publication Date 4/2/2019
 
RAF proto-oncogene serine/threonine-protein kinase
Name:RAF proto-oncogene serine/threonine-protein kinase
Type:Serine/threonine-protein kinase
Mol. Mass.:73082.52
Organism:Homo sapiens (Human)
Description:P04049
Residue:648
BDBM202731
NameBDBM202731
Synonyms:US10245267, Example 77 US9242969, 77 | US9694016, 77
TypeSmall organic molecule
Emp. Form.C27H28F3N5O3
Mol. Mass.527.5381
SMILESCc1ncc(NC(=O)c2cccc(c2)C(F)(F)F)cc1-c1cc(nc(c1)N1CCOCC1)N1CCOCC1