Reaction Details
TargetRAF proto-oncogene serine/threonine-protein kinase
LigandBDBM202850
Substrate/Competitorn/a
Meas. Tech.In Vitro Raf Activity
IC50 0.070±n/a nM
Citation Aversa, RJBarsanti, PABurger, MTDillon, MPDipesa, AHu, CLou, YNishiguchi, GAPan, YPolyakov, VRRamurthy, SRico, ACSetti, LQSmith, ASubramanian, STaft, BRTanner, HRWan, LYusuff, N Biaryl amide compounds as kinase inhibitors US Patent US10245267 Publication Date 4/2/2019
 
RAF proto-oncogene serine/threonine-protein kinase
Name:RAF proto-oncogene serine/threonine-protein kinase
Type:Serine/threonine-protein kinase
Mol. Mass.:73082.52
Organism:Homo sapiens (Human)
Description:P04049
Residue:648
BDBM202850
NameBDBM202850
Synonyms:US10245267, Example 824 US9242969, 203 | US9694016, 824
TypeSmall organic molecule
Emp. Form.C25H22F3N5O2
Mol. Mass.481.4697
SMILESCc1ccc(NC(=O)c2cccc(c2)C(F)(F)F)cc1-c1cn2ccnc2c(n1)N1CCOCC1