Reaction Details
TargetSerine/threonine-protein kinase B-raf [V600E]
LigandBDBM87803
Substrate/Competitorn/a
Meas. Tech.In Vitro Raf Activity
IC50 0.200±n/a nM
Citation Aversa, RJBarsanti, PABurger, MTDillon, MPDipesa, AHu, CLou, YNishiguchi, GAPan, YPolyakov, VRRamurthy, SRico, ACSetti, LQSmith, ASubramanian, STaft, BRTanner, HRWan, LYusuff, N Biaryl amide compounds as kinase inhibitors US Patent US10245267 Publication Date 4/2/2019
 
Serine/threonine-protein kinase B-raf [V600E]
Name:Serine/threonine-protein kinase B-raf [V600E]
Type:n/a
Mol. Mass.:84474.98
Organism:Homo sapiens (Human)
Description:P15056 V600E
Residue:766
BDBM87803
NameBDBM87803
Synonyms:US10245267, Example 837 US9694016, 837
TypeSmall organic molecule
Emp. Form.C25H23F3N6O2
Mol. Mass.496.4843
SMILESCc1ccc(NC(=O)c2cccc(c2)C(F)(F)F)cc1-c1nc(N2CCOCC2)c2n(C)ncc2n1