Reaction Details
TargetRAF proto-oncogene serine/threonine-protein kinase
LigandBDBM87803
Substrate/Competitorn/a
Meas. Tech.In Vitro Raf Activity
IC50 0.100±n/a nM
Citation Aversa, RJBarsanti, PABurger, MTDillon, MPDipesa, AHu, CLou, YNishiguchi, GAPan, YPolyakov, VRRamurthy, SRico, ACSetti, LQSmith, ASubramanian, STaft, BRTanner, HRWan, LYusuff, N Biaryl amide compounds as kinase inhibitors US Patent US10245267 Publication Date 4/2/2019
 
RAF proto-oncogene serine/threonine-protein kinase
Name:RAF proto-oncogene serine/threonine-protein kinase
Type:Serine/threonine-protein kinase
Mol. Mass.:73082.52
Organism:Homo sapiens (Human)
Description:P04049
Residue:648
BDBM87803
NameBDBM87803
Synonyms:US10245267, Example 837 US9694016, 837
TypeSmall organic molecule
Emp. Form.C25H23F3N6O2
Mol. Mass.496.4843
SMILESCc1ccc(NC(=O)c2cccc(c2)C(F)(F)F)cc1-c1nc(N2CCOCC2)c2n(C)ncc2n1