Reaction Details
TargetGag-Pol polyprotein
LigandBDBM372360
Substrate/Competitorn/a
Meas. Tech.HIV Cell Culture Assay
EC50 430±n/a nM
Citation Sit, SChen, YChen, JSwidorski, JVenables, BLSin, NMeanwell, NARegueiro-Ren, AHartz, RAXu, LLiu, Z Triterpenoids with HIV maturation inhibitory activity US Patent US10245275 Publication Date 4/2/2019
 
Gag-Pol polyprotein
Name:Gag-Pol polyprotein
Type:Protein
Mol. Mass.:161820.05
Organism:Human immunodeficiency virus type 1 group M subtype B (isolate NY5) (HIV-1)
Description:P12497
Residue:1435
BDBM372360
NameBDBM372360
Synonyms:Preparation of 1-(2-(((1R,3aS,5aR,5bR,7aR,11aS,11bR,13aR,13bR)-9-((R)-4-carboxy-4-(fluoromethyl)cyclohex-1-en-1-yl)-5a,5b,8,8,11a-pentamethyl-1-(prop-1-en-2-yl)-2,3,3a,4,5,5a,5b,6,7,7a,8,11,11a,11b,12,13,13a,13b-octadecahydro-1H-cyclopenta[a]chrysen-3a-yl)amino)ethyl)piperidine-4,4-dicarboxylic acid | US10245275, Example 16
TypeSmall organic molecule
Emp. Form.C46H69FN2O6
Mol. Mass.765.0483
SMILESCC(=C)[C@@H]1CC[C@@]2(CC[C@]3(C)[C@H](CC[C@@H]4[C@@]5(C)CC=C(C6=CC[C@](CF)(CC6)C(O)=O)C(C)(C)[C@@H]5CC[C@@]34C)[C@@H]12)NCCN1CCC(CC1)(C(O)=O)C(O)=O