Reaction Details
TargetProstaglandin G/H synthase 2
LigandBDBM22360
Substrate/CompetitorBDBM22319
Meas. Tech.COX Inhibitor Screening Assay
pH8±n/a
Temperature310.15±n/a K
IC50 2400±n/a nM
Citation Rao, PNChen, QHKnaus, EE Synthesis and structure-activity relationship studies of 1,3-diarylprop-2-yn-1-ones: dual inhibitors of cyclooxygenases and lipoxygenases. J Med Chem49:1668-83 (2006) 
 
Prostaglandin G/H synthase 2
Name:Prostaglandin G/H synthase 2
Type:Enzyme
Mol. Mass.:69003.89
Organism:Homo sapiens (Human)
Description:Recombinant Cox-2 provided by Cayman (Cayman Chemical Co.,Ann Arbor, MI).
Residue:604
BDBM22360
BDBM22319
NameBDBM22360
Synonyms:2-(acetyloxy)benzoate Acetylsalicylic acid Endosprin Zorprin cid_2244
TypeAnti-Inflammatory Agents, Non-Steroidal
Emp. Form.C9H8O4
Mol. Mass.180.1574
SMILESCC(=O)Oc1ccccc1C(O)=O