Reaction Details
TargetSodium-dependent dopamine transporter
LigandBDBM22402
Substrate/CompetitorBDBM22166
Meas. Tech.Ligand Binding Assay
Ki 39±n/a nM
EC50 63±n/a nM
Citation Gong, PKBlough, BEBrieaddy, LEHuang, XKuhar, MJNavarro, HACarroll, FI Synthesis, monoamine transporter binding, properties, and functional monoamine uptake activity of 3beta-[4-methylphenyl and 4-chlorophenyl]-2 beta-[5-(substituted phenyl)thiazol-2-yl]tropanes. J Med Chem50:3686-95 (2007) 
 
Sodium-dependent dopamine transporter
Name:Sodium-dependent dopamine transporter
Type:Multi-pass membrane protein
Mol. Mass.:68497.11
Organism:Homo sapiens (Human)
Description:Q01959
Residue:620
BDBM22402
BDBM22166
NameBDBM22402
Synonyms:5-(3-bromophenyl)-2-[(1R,2S,3S,5S)-3-(4-chlorophenyl)-8-methyl-8-azabicyclo[3.2.1]octan-2-yl]-1,3-thiazole | WIN 35,065-2 Analogue, 4e
TypeSmall organic molecule
Emp. Form.C23H22BrClN2S
Mol. Mass.473.856
SMILESCN1[C@H]2CC[C@@H]1[C@H]([C@H](C2)c1ccc(Cl)cc1)c1ncc(s1)-c1cccc(Br)c1