Reaction Details
TargetSodium-dependent dopamine transporter
LigandBDBM22413
Substrate/CompetitorBDBM22166
Meas. Tech.Ligand Binding Assay
Ki 53±n/a nM
EC50 226±n/a nM
Citation Gong, PKBlough, BEBrieaddy, LEHuang, XKuhar, MJNavarro, HACarroll, FI Synthesis, monoamine transporter binding, properties, and functional monoamine uptake activity of 3beta-[4-methylphenyl and 4-chlorophenyl]-2 beta-[5-(substituted phenyl)thiazol-2-yl]tropanes. J Med Chem50:3686-95 (2007) 
 
Sodium-dependent dopamine transporter
Name:Sodium-dependent dopamine transporter
Type:Multi-pass membrane protein
Mol. Mass.:68497.11
Organism:Homo sapiens (Human)
Description:Q01959
Residue:620
BDBM22413
BDBM22166
NameBDBM22413
Synonyms:5-(4-methoxyphenyl)-2-[(1R,2S,3S,5S)-8-methyl-3-(4-methylphenyl)-8-azabicyclo[3.2.1]octan-2-yl]-1,3-thiazole | WIN 35,065-2 Analogue, 4q
TypeSmall organic molecule
Emp. Form.C25H28N2OS
Mol. Mass.404.568
SMILESCOc1ccc(cc1)-c1cnc(s1)[C@@H]1[C@H]2CC[C@@H](C[C@@H]1c1ccc(C)cc1)N2C