Reaction Details
TargetMetabotropic glutamate receptor 5
LigandBDBM50113473
Substrate/Competitorn/a
Meas. Tech.[3H]-M-MPEP Radioligand Binding Assay
Ki 1.23±n/a nM
Citation Christopher, JACongreve, MSAves, SJTehan, BG 4-(3-cyanophenyl)-6-pyridinylpyrimidine mGlu5 modulators US Patent US10246432 Publication Date 4/2/2019
 
Metabotropic glutamate receptor 5
Name:Metabotropic glutamate receptor 5
Type:Enzyme
Mol. Mass.:132484.72
Organism:Homo sapiens (Human)
Description:n/a
Residue:1212
BDBM50113473
NameBDBM50113473
Synonyms:CHEMBL3603920 US10584111, Ex No. 1 | US11584732, Example 1
TypeSmall organic molecule
Emp. Form.C16H8ClFN4
Mol. Mass.310.713
SMILESFc1c(Cl)cc(cc1-c1cc(ncn1)-c1ccccn1)C#N