Reaction Details
TargetMetabotropic glutamate receptor 5
LigandBDBM372970
Substrate/Competitorn/a
Meas. Tech.[3H]-M-MPEP Radioligand Binding Assay
Ki 6.92±n/a nM
Citation Christopher, JACongreve, MSAves, SJTehan, BG 4-(3-cyanophenyl)-6-pyridinylpyrimidine mGlu5 modulators US Patent US10246432 Publication Date 4/2/2019
 
Metabotropic glutamate receptor 5
Name:Metabotropic glutamate receptor 5
Type:Enzyme
Mol. Mass.:132484.72
Organism:Homo sapiens (Human)
Description:n/a
Residue:1212
BDBM372970
NameBDBM372970
Synonyms:3-chloro-4-fluoro-5-[2- US10584111, Ex No. 11 | US11584732, Example 11
TypeSmall organic molecule
Emp. Form.C15H8ClFN4
Mol. Mass.298.702
SMILESFc1c(Cl)cc(cc1-c1ccnc(c1)-n1cccn1)C#N