Reaction Details
TargetEstrogen receptor
LigandBDBM22427
Substrate/Competitor[3H]]estradiol
Meas. Tech.Radioligand Displacement Assay
pH7.4±n/a
Temperature295.15±n/a K
IC50 1±n/a nM
Citation Chao, EYCollins, JLGaillard, SMiller, ABWang, LOrband-Miller, LANolte, RTMcDonnell, DPWillson, TMZuercher, WJ Structure-guided synthesis of tamoxifen analogs with improved selectivity for the orphan ERRgamma. Bioorg Med Chem Lett16:821-4 (2006) 
 
Estrogen receptor
Name:Estrogen receptor
Type:Protein
Mol. Mass.:66230.44
Organism:Homo sapiens (Human)
Description:P03372
Residue:595
BDBM22427
[3H]]estradiol
NameBDBM22427
Synonyms:4-[(1Z)-4-azido-1-{4-[2-(dimethylamino)ethoxy]phenyl}-2-phenylbut-1-en-1-yl]phenol | 4-hydroxytamoxifen (4-OHT) analog, 7
TypeSmall organic molecule
Emp. Form.C26H28N4O2
Mol. Mass.428.5261
SMILESCN(C)CCOc1ccc(cc1)C(=C(\CCN=[N+]=[N-])c1ccccc1)\c1ccc(O)cc1