Reaction Details
TargetEstrogen-related receptor gamma
LigandBDBM22429
Substrate/CompetitorBDBM20608
Meas. Tech.Radioligand Displacement Assay
pH7.4±n/a
Temperature295.15±n/a K
IC50 1000±n/a nM
Citation Chao, EYCollins, JLGaillard, SMiller, ABWang, LOrband-Miller, LANolte, RTMcDonnell, DPWillson, TMZuercher, WJ Structure-guided synthesis of tamoxifen analogs with improved selectivity for the orphan ERRgamma. Bioorg Med Chem Lett16:821-4 (2006) 
 
Estrogen-related receptor gamma
Name:Estrogen-related receptor gamma
Type:PROTEIN
Mol. Mass.:51305.00
Organism:Homo sapiens (Human)
Description:ChEMBL_1501351
Residue:458
BDBM22429
BDBM20608
NameBDBM22429
Synonyms:4-[(1Z)-1-{4-[2-(dimethylamino)ethoxy]phenyl}-5-(methylsulfanyl)-2-phenylpent-1-en-1-yl]phenol | 4-hydroxytamoxifen (4-OHT) analog, 9
TypeSmall organic molecule
Emp. Form.C28H33NO2S
Mol. Mass.447.632
SMILESCSCCC\C(=C(/c1ccc(O)cc1)c1ccc(OCCN(C)C)cc1)c1ccccc1