Reaction Details
TargetGenome polyprotein
LigandBDBM65583
Substrate/Competitorn/a
Meas. Tech.Pseudotyped HCV particle (HCVpp) reporter assay
EC50 5.0±n/a nM
Citation Bilotta, JAChen, ZChi, FChin, EDing, QErickson, SDGabriel, SDJiang, NKocer, BMertz, EPlancher, JWeikert, RJZhang, JZhang, Q Antiviral compounds US Patent US9693997 Publication Date 7/4/2017
 
Genome polyprotein
Name:Genome polyprotein
Type:Protease Domain
Mol. Mass.:327221.49
Organism:Hepatitis C virus (HCV genotype 1a, isolate H)
Description:P27958
Residue:3011
BDBM65583
NameBDBM65583
Synonyms:US9693997, 2
TypeSmall organic molecule
Emp. Form.C26H30ClF3N6O4S
Mol. Mass.615.067
SMILESCC(C)(C)OC(=O)N1CCCC(CS(=O)(=O)c2ccc(cc2)-c2c(Cl)cc(Nc3n[nH]c(N)n3)cc2C(F)(F)F)C1