Reaction Details
TargetGenome polyprotein
LigandBDBM65592
Substrate/Competitorn/a
Meas. Tech.Pseudotyped HCV particle (HCVpp) reporter assay
EC50 15±n/a nM
Citation Bilotta, JAChen, ZChi, FChin, EDing, QErickson, SDGabriel, SDJiang, NKocer, BMertz, EPlancher, JWeikert, RJZhang, JZhang, Q Antiviral compounds US Patent US9693997 Publication Date 7/4/2017
 
Genome polyprotein
Name:Genome polyprotein
Type:Protease Domain
Mol. Mass.:327221.49
Organism:Hepatitis C virus (HCV genotype 1a, isolate H)
Description:P27958
Residue:3011
BDBM65592
NameBDBM65592
Synonyms:US9693997, 10
TypeSmall organic molecule
Emp. Form.C20H20ClF3N6O2S
Mol. Mass.500.925
SMILESCC(C)(C)N1Cc2ccc(cc2S1(=O)=O)-c1c(Cl)cc(Nc2n[nH]c(N)n2)cc1C(F)(F)F