Reaction Details
TargetGenome polyprotein
LigandBDBM65594
Substrate/Competitorn/a
Meas. Tech.Pseudotyped HCV particle (HCVpp) reporter assay
EC50 17±n/a nM
Citation Bilotta, JAChen, ZChi, FChin, EDing, QErickson, SDGabriel, SDJiang, NKocer, BMertz, EPlancher, JWeikert, RJZhang, JZhang, Q Antiviral compounds US Patent US9693997 Publication Date 7/4/2017
 
Genome polyprotein
Name:Genome polyprotein
Type:Protease Domain
Mol. Mass.:327221.49
Organism:Hepatitis C virus (HCV genotype 1a, isolate H)
Description:P27958
Residue:3011
BDBM65594
NameBDBM65594
Synonyms:US9693997, 11
TypeSmall organic molecule
Emp. Form.C23H23ClF6N6O2S
Mol. Mass.596.976
SMILESNc1nc(Nc2cc(Cl)c(-c3ccc(cc3)S(=O)(=O)C3CCCN(CCC(F)(F)F)C3)c(c2)C(F)(F)F)n[nH]1