Reaction Details
TargetGenome polyprotein
LigandBDBM70637
Substrate/Competitorn/a
Meas. Tech.Pseudotyped HCV particle (HCVpp) reporter assay
EC50 9.0±n/a nM
Citation Bilotta, JAChen, ZChi, FChin, EDing, QErickson, SDGabriel, SDJiang, NKocer, BMertz, EPlancher, JWeikert, RJZhang, JZhang, Q Antiviral compounds US Patent US9693997 Publication Date 7/4/2017
 
Genome polyprotein
Name:Genome polyprotein
Type:Protease Domain
Mol. Mass.:327221.49
Organism:Hepatitis C virus (HCV genotype 1a, isolate H)
Description:P27958
Residue:3011
BDBM70637
NameBDBM70637
Synonyms:US9693997, 167
TypeSmall organic molecule
Emp. Form.C22H24ClF3N6O4S
Mol. Mass.560.977
SMILESCOc1cc(ccc1S(=O)(=O)N[C@H]1CC[C@H](O)CC1)-c1c(Cl)cc(Nc2n[nH]c(N)n2)cc1C(F)(F)F