Reaction Details
TargetGenome polyprotein
LigandBDBM70639
Substrate/Competitorn/a
Meas. Tech.Pseudotyped HCV particle (HCVpp) reporter assay
EC50 11±n/a nM
Citation Bilotta, JAChen, ZChi, FChin, EDing, QErickson, SDGabriel, SDJiang, NKocer, BMertz, EPlancher, JWeikert, RJZhang, JZhang, Q Antiviral compounds US Patent US9693997 Publication Date 7/4/2017
 
Genome polyprotein
Name:Genome polyprotein
Type:Protease Domain
Mol. Mass.:327221.49
Organism:Hepatitis C virus (HCV genotype 1a, isolate H)
Description:P27958
Residue:3011
BDBM70639
NameBDBM70639
Synonyms:US9693997, 169
TypeSmall organic molecule
Emp. Form.C18H16ClF3N6O2S
Mol. Mass.472.872
SMILESNc1nc(Nc2cc(Cl)c(-c3ccc(cc3)S(=O)(=O)NC3CC3)c(c2)C(F)(F)F)n[nH]1