Reaction Details
TargetGenome polyprotein
LigandBDBM70646
Substrate/Competitorn/a
Meas. Tech.Pseudotyped HCV particle (HCVpp) reporter assay
EC50 19±n/a nM
Citation Bilotta, JAChen, ZChi, FChin, EDing, QErickson, SDGabriel, SDJiang, NKocer, BMertz, EPlancher, JWeikert, RJZhang, JZhang, Q Antiviral compounds US Patent US9693997 Publication Date 7/4/2017
 
Genome polyprotein
Name:Genome polyprotein
Type:Protease Domain
Mol. Mass.:327221.49
Organism:Hepatitis C virus (HCV genotype 1a, isolate H)
Description:P27958
Residue:3011
BDBM70646
NameBDBM70646
Synonyms:US9693997, 173
TypeSmall organic molecule
Emp. Form.C19H18ClF3N6O3S
Mol. Mass.502.898
SMILESNc1nc(Nc2cc(Cl)c(-c3ccc(cc3)S(=O)(=O)N[C@H]3C[C@H](O)C3)c(c2)C(F)(F)F)n[nH]1