Reaction Details
TargetGenome polyprotein
LigandBDBM70690
Substrate/Competitorn/a
Meas. Tech.Pseudotyped HCV particle (HCVpp) reporter assay
EC50 12±n/a nM
Citation Bilotta, JAChen, ZChi, FChin, EDing, QErickson, SDGabriel, SDJiang, NKocer, BMertz, EPlancher, JWeikert, RJZhang, JZhang, Q Antiviral compounds US Patent US9693997 Publication Date 7/4/2017
 
Genome polyprotein
Name:Genome polyprotein
Type:Protease Domain
Mol. Mass.:327221.49
Organism:Hepatitis C virus (HCV genotype 1a, isolate H)
Description:P27958
Residue:3011
BDBM70690
NameBDBM70690
Synonyms:US9693997, 210 | US9693997, 211
TypeSmall organic molecule
Emp. Form.C22H25ClF3N7O2S
Mol. Mass.543.993
SMILESCC(C)N1CC(C)(C1)NS(=O)(=O)c1ccc(cc1)-c1c(Cl)cc(Nc2n[nH]c(N)n2)cc1C(F)(F)F