Reaction Details
Target11-beta-hydroxysteroid dehydrogenase 1
LigandBDBM22474
Substrate/CompetitorBDBM13739
Meas. Tech.Human 11beta-HSD1 Scintillation Proximity Assay (SPA)
pH7.2±n/a
Temperature295.15±n/a K
Ki 20±7 nM
Citation Johansson, LFotsch, CBartberger, MDCastro, VMChen, MEmery, MGustafsson, SHale, CHickman, DHoman, EJordan, SRKomorowski, RLi, AMcRae, KMoniz, GMatsumoto, GOrihuela, CPalm, GVeniant, MWang, MWilliams, MZhang, J 2-Amino-1,3-thiazol-4(5H)-ones as Potent and Selective 11beta-Hydroxysteroid Dehydrogenase Type 1 Inhibitors: Enzyme-Ligand Co-Crystal Structure and Demonstration of Pharmacodynamic Effects in C57Bl/6 Mice. J Med Chem51:2933-43 (2008) 
 
11-beta-hydroxysteroid dehydrogenase 1
Name:11-beta-hydroxysteroid dehydrogenase 1
Type:Enzyme
Mol. Mass.:32409.16
Organism:Homo sapiens (Human)
Description:P28845
Residue:292
BDBM22474
BDBM13739
NameBDBM22474
Synonyms:2-(adamantan-1-ylamino)-5,5-diethyl-4,5-dihydro-1,3-thiazol-4-one | 2-Amino-1,3-thiazol-4(5H)-one, 7c
TypeSmall organic molecule
Emp. Form.C17H26N2OS
Mol. Mass.306.466
SMILESCCC1(CC)SC(NC23CC4CC(CC(C4)C2)C3)=NC1=O