Reaction Details
TargetLysine-specific demethylase 2B
LigandBDBM276069
Substrate/Competitorn/a
Meas. Tech.FBXL10 Assay
IC50<100±n/a nM
Citation Chen, YKNie, ZStafford, JAVeal, JM Histone demethylase inhibitors US Patent US9896436 Publication Date 2/20/2018
 
Lysine-specific demethylase 2B
Name:Lysine-specific demethylase 2B
Type:Enzyme Catalytic Domain
Mol. Mass.:152658.35
Organism:Homo sapiens (Human)
Description:Q8NHM5
Residue:1336
BDBM276069
NameBDBM276069
Synonyms:4-(1H-triazol-4-yl)-2-[1-[2-[2-(trifluoromethyl)phenyl]ethyl]imidazol-4-yl]pyridine US10174003, Example 31 | US9896436, Example 31
TypeSmall organic molecule
Emp. Form.C19H15F3N6
Mol. Mass.384.3578
SMILESFC(F)(F)c1ccccc1CCn1cnc(c1)-c1cc(ccn1)-c1c[nH]nn1