Reaction Details
TargetHistone lysine demethylase PHF8
LigandBDBM276076
Substrate/Competitorn/a
Meas. Tech.PHF8 Assay
IC50>10000±n/a nM
Citation Chen, YKNie, ZStafford, JAVeal, JM Histone demethylase inhibitors US Patent US9896436 Publication Date 2/20/2018
 
Histone lysine demethylase PHF8
Name:Histone lysine demethylase PHF8
Type:Protein
Mol. Mass.:117889.91
Organism:Homo sapiens (Human)
Description:Q9UPP1
Residue:1060
BDBM276076
NameBDBM276076
Synonyms:4-(5-iodo-1H-triazol-4-yl)-2-[1-(2-naphthalen-1-ylethyl)imidazol-4-yl]pyridine US10174003, Example 38 | US9896436, Example 38
TypeSmall organic molecule
Emp. Form.C22H17IN6
Mol. Mass.492.3151
SMILESIc1[nH]nnc1-c1ccnc(c1)-c1cn(CCc2cccc3ccccc23)cn1