Reaction Details
TargetHistamine H3 receptor
LigandBDBM22531
Substrate/CompetitorBDBM22530
Meas. Tech.H3R Radioligand Binding Assay
pH7.4±n/a
Temperature298.15±n/a K
Ki 155±40 nM
Citation Wijtmans, MCelanire, SSnip, EGillard, MRGelens, ECollart, PPVenhuis, BJChristophe, BHulscher, Svan der Goot, HLebon, FTimmerman, HBakker, RALallemand, BILeurs, RTalaga, PEde Esch, IJ 4-benzyl-1H-imidazoles with oxazoline termini as histamine H3 receptor agonists. J Med Chem51:2944-53 (2008) 
 
Histamine H3 receptor
Name:Histamine H3 receptor
Type:G Protein-Coupled Receptor (GPCR)
Mol. Mass.:48691.47
Organism:Homo sapiens (Human)
Description:Binding assays were using CHO cells stably expressing hH3R receptors.
Residue:445
BDBM22531
BDBM22530
NameBDBM22531
Synonyms:3-(1H-imidazol-4-ylmethyl)benzonitrile | 4-Benzyl-1H-imidazole derivative, 12
TypeSmall organic molecule
Emp. Form.C11H9N3
Mol. Mass.183.2093
SMILESN#Cc1cccc(Cc2cnc[nH]2)c1