Reaction Details
TargetHistamine H3 receptor
LigandBDBM22553
Substrate/CompetitorBDBM22530
Meas. Tech.H3R Radioligand Binding Assay
pH7.4±n/a
Temperature298.15±n/a K
Ki 2512±348 nM
Citation Wijtmans, MCelanire, SSnip, EGillard, MRGelens, ECollart, PPVenhuis, BJChristophe, BHulscher, Svan der Goot, HLebon, FTimmerman, HBakker, RALallemand, BILeurs, RTalaga, PEde Esch, IJ 4-benzyl-1H-imidazoles with oxazoline termini as histamine H3 receptor agonists. J Med Chem51:2944-53 (2008) 
 
Histamine H3 receptor
Name:Histamine H3 receptor
Type:G Protein-Coupled Receptor (GPCR)
Mol. Mass.:48691.47
Organism:Homo sapiens (Human)
Description:Binding assays were using CHO cells stably expressing hH3R receptors.
Residue:445
BDBM22553
BDBM22530
NameBDBM22553
Synonyms:2-[3-(1H-imidazol-4-ylmethyl)phenyl]-5,5-dimethyl-5,6-dihydro-4H-1,3-oxazine | 4-Benzyl-1H-imidazole derivative, 31
TypeSmall organic molecule
Emp. Form.C16H19N3O
Mol. Mass.269.3416
SMILESCC1(C)COC(=NC1)c1cccc(Cc2cnc[nH]2)c1