Reaction Details
TargetHistamine H4 receptor
LigandBDBM22537
Substrate/CompetitorBDBM7966
Meas. Tech.H4R Radioligand Binding Assay
pH7.4±n/a
Temperature298.15±n/a K
Ki 6±1 nM
Citation Wijtmans, MCelanire, SSnip, EGillard, MRGelens, ECollart, PPVenhuis, BJChristophe, BHulscher, Svan der Goot, HLebon, FTimmerman, HBakker, RALallemand, BILeurs, RTalaga, PEde Esch, IJ 4-benzyl-1H-imidazoles with oxazoline termini as histamine H3 receptor agonists. J Med Chem51:2944-53 (2008) 
 
Histamine H4 receptor
Name:Histamine H4 receptor
Type:G Protein-Coupled Receptor (GPCR)
Mol. Mass.:44517.02
Organism:Homo sapiens (Human)
Description:Binding assays were using CHO cells stably expressing hH4R receptors.
Residue:390
BDBM22537
BDBM7966
NameBDBM22537
Synonyms:4-Benzyl-1H-imidazole derivative, 18 | 4-{[3-(3,3-dimethylbut-1-yn-1-yl)phenyl]methyl}-1H-imidazole
TypeSmall organic molecule
Emp. Form.C16H18N2
Mol. Mass.238.3275
SMILESCC(C)(C)C#Cc1cccc(Cc2cnc[nH]2)c1