Reaction Details
TargetHistamine H4 receptor
LigandBDBM22557
Substrate/CompetitorBDBM7966
Meas. Tech.Radioligand Binding Assay
pH7.5±n/a
Temperature298.15±n/a K
Ki 93±n/a nM
Citation Lee-Dutra, AArienti, KLBuzard, DJHack, MDKhatuya, HDesai, PJNguyen, SThurmond, RLKarlsson, LEdwards, JPBreitenbucher, JG Identification of 2-arylbenzimidazoles as potent human histamine H4 receptor ligands. Bioorg Med Chem Lett16:6043-8 (2006) 
 
Histamine H4 receptor
Name:Histamine H4 receptor
Type:G Protein-Coupled Receptor (GPCR)
Mol. Mass.:44517.02
Organism:Homo sapiens (Human)
Description:Binding assays were using CHO cells stably expressing hH4R receptors.
Residue:390
BDBM22557
BDBM7966
NameBDBM22557
Synonyms:2-arylbenzimidazole derivative, 3 | 5-tert-butyl-2-{2-chloro-4-[3-(4-methylpiperazin-1-yl)propoxy]phenyl}-1H-1,3-benzodiazole
TypeSmall organic molecule
Emp. Form.C25H33ClN4O
Mol. Mass.441.009
SMILESCN1CCN(CCCOc2ccc(-c3nc4ccc(cc4[nH]3)C(C)(C)C)c(Cl)c2)CC1