Reaction Details
TargetHistamine H3 receptor
LigandBDBM22566
Substrate/CompetitorBDBM22530
Meas. Tech.Radioligand Binding Assay
pH7.5±n/a
Temperature298.15±n/a K
Ki 5125±1087 nM
Citation Thurmond, RLDesai, PJDunford, PJFung-Leung, WPHofstra, CLJiang, WNguyen, SRiley, JPSun, SWilliams, KNEdwards, JPKarlsson, L A potent and selective histamine H4 receptor antagonist with anti-inflammatory properties. J Pharmacol Exp Ther309:404-13 (2004) 
 
Histamine H3 receptor
Name:Histamine H3 receptor
Type:G Protein-Coupled Receptor (GPCR)
Mol. Mass.:48691.47
Organism:Homo sapiens (Human)
Description:Binding assays were using CHO cells stably expressing hH3R receptors.
Residue:445
BDBM22566
BDBM22530
NameBDBM22566
Synonyms:5-chloro-2-[(4-methylpiperazin-1-yl)carbonyl]-1H-indole JNJ 7777120
TypeSmall organic molecule
Emp. Form.C14H16ClN3O
Mol. Mass.277.749
SMILESCN1CCN(CC1)C(=O)c1cc2cc(Cl)ccc2[nH]1