Reaction Details
TargetPhosphoribosylglycinamide formyltransferase
LigandBDBM22585
Substrate/CompetitorBDBM22589
Meas. Tech.GAR Tfase Activity Assay
pH7.5±n/a
Temperature299.15±n/a K
Ki>100000±n/a nM
Citation Xu, LChong, YHwang, ID'Onofrio, AAmore, KBeardsley, GPLi, COlson, AJBoger, DLWilson, IA Structure-based design, synthesis, evaluation, and crystal structures of transition state analogue inhibitors of inosine monophosphate cyclohydrolase. J Biol Chem282:13033-46 (2007) 
 
Phosphoribosylglycinamide formyltransferase
Name:Phosphoribosylglycinamide formyltransferase
Type:Enzyme
Mol. Mass.:23233.97
Organism:Escherichia coli (strain K12)
Description:n/a
Residue:212
BDBM22585
BDBM22589
NameBDBM22585
Synonyms:1H,3H,4H,7H-2,1,3,5,7-imidazo[4,5-c][1,2,6]thiadiazine-2,2,4-trione | Heterocycle, 1
TypeSmall organic molecule
Emp. Form.C4H4N4O3S
Mol. Mass.188.165
SMILESO=C1NS(=O)(=O)Nc2nc[nH]c12