Reaction Details
TargetTyrosine-protein kinase ABL1 [64-515]
LigandBDBM230826
Substrate/Competitorn/a
Meas. Tech.Caliper Assay
IC50<0.130±n/a nM
Citation Furet, PGrotzfeld, RMJahnke, WJones, DManley, PWMarzinzik, APelle, XFSalem, BSchoepfer, J Benzamide derivatives for inhibiting the activity of ABL1, ABL2 and BCR-ABL1 US Patent US9896444 Publication Date 2/20/2018
 
Tyrosine-protein kinase ABL1 [64-515]
Name:Tyrosine-protein kinase ABL1 [64-515]
Type:Enzyme Catalytic Domain
Mol. Mass.:51539.77
Organism:Homo sapiens (Human)
Description:aa 64-515
Residue:452
BDBM230826
NameBDBM230826
Synonyms:US9340537, 80 | US9896444, Example 80
TypeSmall organic molecule
Emp. Form.C21H21ClF2N6O3
Mol. Mass.478.88
SMILESNC[C@H]1CN(C[C@H]1O)c1ncc(cc1-c1ccn[nH]1)C(=O)Nc1ccc(OC(F)(F)Cl)cc1