Reaction Details
TargetCoagulation factor XII
LigandBDBM22726
Substrate/CompetitorBDBM22723
Meas. Tech.Enzyme Inhibition Assay
pH7.4±n/a
Temperature298.15±n/a K
Ki>100000±n/a nM
Citation Wadkins, RMHyatt, JLWei, XYoon, KJWierdl, MEdwards, CCMorton, CLObenauer, JCDamodaran, KBeroza, PDanks, MKPotter, PM Identification and characterization of novel benzil (diphenylethane-1,2-dione) analogues as inhibitors of mammalian carboxylesterases. J Med Chem48:2906-15 (2005) 
 
Coagulation factor XII
Name:Coagulation factor XII
Type:Enzyme
Mol. Mass.:67810.07
Organism:Homo sapiens (Human)
Description:P00748
Residue:615
BDBM22726
BDBM22723
NameBDBM22726
Synonyms:Benzophenone diphenylmethanone
TypeSmall organic molecule
Emp. Form.C13H10O
Mol. Mass.182.2179
SMILESO=C(c1ccccc1)c1ccccc1