Reaction Details
TargetCoagulation factor XII
LigandBDBM22733
Substrate/CompetitorBDBM22723
Meas. Tech.Enzyme Inhibition Assay
pH7.4±n/a
Temperature298.15±n/a K
Ki>100000±n/a nM
Citation Wadkins, RMHyatt, JLWei, XYoon, KJWierdl, MEdwards, CCMorton, CLObenauer, JCDamodaran, KBeroza, PDanks, MKPotter, PM Identification and characterization of novel benzil (diphenylethane-1,2-dione) analogues as inhibitors of mammalian carboxylesterases. J Med Chem48:2906-15 (2005) 
 
Coagulation factor XII
Name:Coagulation factor XII
Type:Enzyme
Mol. Mass.:67810.07
Organism:Homo sapiens (Human)
Description:P00748
Residue:615
BDBM22733
BDBM22723
NameBDBM22733
Synonyms:1,2-bis(4-bromophenyl)ethane-1,2-dione | Benzil-based compound, 11
TypeSmall organic molecule
Emp. Form.C14H8Br2O2
Mol. Mass.368.02
SMILESBrc1ccc(cc1)C(=O)C(=O)c1ccc(Br)cc1