Reaction Details
TargetCoagulation factor XII
LigandBDBM22735
Substrate/CompetitorBDBM22723
Meas. Tech.Enzyme Inhibition Assay
pH7.4±n/a
Temperature298.15±n/a K
Ki 259±53 nM
Citation Wadkins, RMHyatt, JLWei, XYoon, KJWierdl, MEdwards, CCMorton, CLObenauer, JCDamodaran, KBeroza, PDanks, MKPotter, PM Identification and characterization of novel benzil (diphenylethane-1,2-dione) analogues as inhibitors of mammalian carboxylesterases. J Med Chem48:2906-15 (2005) 
 
Coagulation factor XII
Name:Coagulation factor XII
Type:Enzyme
Mol. Mass.:67810.07
Organism:Homo sapiens (Human)
Description:P00748
Residue:615
BDBM22735
BDBM22723
NameBDBM22735
Synonyms:1,2-bis(3,4,5-trifluorophenyl)ethane-1,2-dione CHEMBL193180
TypeSmall organic molecule
Emp. Form.C14H4F6O2
Mol. Mass.318.1708
SMILESFc1cc(cc(F)c1F)C(=O)C(=O)c1cc(F)c(F)c(F)c1